سامانۀ پادکنش فروسرخ حلقه‌بسته
scope note: نوعی سامانۀ پادکنش فروسرخ که در آن با بهره‌گیری از لیزر پرقدرت، موشک‌های فروسرخ نزدیک‌شونده را کور می‌کنند.
broader: پادکنش
preferred label: closed-loop infrared countermeasures @en
type: Concept

پادکنش
preferred label: countermeasures @en
type: Concept
narrower: سامانۀ پادکنش فروسرخ حلقه‌بسته