پادکنش
preferred label: countermeasures @en
type: Concept
narrower: پادکنش ارتباطی

پادکنش ارتباطی
scope note: هر اقدام سطح بالا ازنظر فنی و اهداف و نتایج نظیر رهگیری و جست‌وجو که برای شناسایی و مکان‌یابی سامانه و تجهیزات ارتباطی دشمن و ایجاد اختلال و سردرگمی در آن یا کژاطلاع‌رسانی به آن طراحی شده باشد.
broader: پادکنش
preferred label: communication countermeasures @en
type: Concept