پادکنش
preferred label: countermeasures @en
type: Concept
narrower: پادکنش ویروس رایانه‌ای

پادکنش ویروس رایانه‌ای
scope note: یکی از فنون جنگ الکترونیکی که در آن ویروس رایانه‌ای را وارد سامانۀ الکترونیکی دشمن می‌کنند.
related: ویروس رایانه‌ای
broader: پادکنش
preferred label: computer virus countermeasures @en
type: Concept

ویروس رایانه‌ای
preferred label: computer virus @en
type: Concept
related: پادکنش ویروس رایانه‌ای