پادکنش الکترونیکی تابشی
alternative label: پادکال تابشی
scope note: نوعی پادکنش در جنگ اطلاعات شامل تابش یا بازتابش انرژی الکترومغناطیسی در طیف بسامد رادیویی برای جلوگیری یا کاهش استفادۀ مؤثر دشمن از طیف الکترومغناطیسی یا آسیب‌رسانی مؤثر به حسگرها یا سامانۀ او
broader: پادکنش الکترونیکی
preferred label: radiated electronic countermeasures @en
type: Concept

پادکنش الکترونیکی
preferred label: electronic countermeasure @en
type: Concept
narrower: پادکنش الکترونیکی تابشی