پادکنش
preferred label: countermeasures @en
type: Concept
narrower: پادکنش وضعیت نهایی

پادکنش وضعیت نهایی
scope note: نوعی پادکنش برای آشکارسازی موشک‌های فروسرخ پرتابی در هواگَرد میزبان و به‌کارگیری خودکار منور برای منحرف ساختن آنها
broader: پادکنش
preferred label: endgame countermeasures @en
type: Concept