پادکنش فروسرخ هدایتی همدوس
scope note: نوعی پادکنش فروسرخ سمتی که در آن نورِ تابیده‌شده رنگ یا طولِ‌موجی یکسان دارد و همۀ فوتون‌ها همدوسی فازی دارند.
broader: پادکنش فروسرخ
preferred label: coherent directed infrared countermeasures @en
type: Concept

پادکنش فروسرخ
preferred label: infrared countermeasures @en
type: Concept
narrower: پادکنش فروسرخ هدایتی همدوس