پادکنش فروسرخ سمتی
scope note: نوعی پادکنش که در آن از اختلال فروسرخ سمتی پرقدرت استفاده می‌کنند.
broader: پادکنش فروسرخ
preferred label: directional infrared countermeasures @en
type: Concept

پادکنش فروسرخ
preferred label: infrared countermeasures @en
type: Concept
narrower: پادکنش فروسرخ سمتی