پادکنش فروسرخ واکنشی
scope note: نوعی پادکنش فروسرخ که در آن اختلال‌گرهای فروسرخ فعال می‌شوند و در هنگام نزدیک شدن موشک فروسرخ، منور فریب‌دهنده پرتاب می‌شود.
broader: پادکنش فروسرخ
preferred label: reactive infrared countermeasures @en
type: Concept

پادکنش فروسرخ
preferred label: infrared countermeasures @en
type: Concept
narrower: پادکنش فروسرخ واکنشی