پادکنش
preferred label: countermeasures @en
type: Concept
narrower: مین‌پادکنش

مین‌پادکنش
scope note: مجموعه‌ای از فنون و راهکنش‌هایی که برای شناسایی و طبقه‌بندی و خنثی‌سازی مین‌های زمینی و دریایی به کار گرفته می‌شود.
broader: پادکنش
preferred label: mine countermeasures @en
type: Concept