پادکنش
preferred label: countermeasures @en
type: Concept
narrower: پادکنش ناوبری

ناوبری
preferred label: navigation @en
type: Concept
related: پادکنش ناوبری

پادکنش ناوبری
scope note: نوعی پادکنش برای آشکارسازی و ارزیابی اقدامات کمک‌ناوبری الکترونیکی دشمن و نیز به‌کارگیری اختلال و فریب برای تداخل در اقدامات مشابه دشمن
related: ناوبری
broader: پادکنش
preferred label: navigation countermeasures @en
type: Concept