پادکنش
preferred label: countermeasures @en
type: Concept
narrower: سامانۀ پادکنش بیرونی

سامانۀ پادکنش بیرونی
scope note: نوعی سامانۀ پادکنش که با هواگَرد حمل می‌شود و در صورت خطر حملۀ مستقیم برای پرتاب آماده می‌شود.
broader: پادکنش
preferred label: off-board countermeasures @en
type: Concept