پادکنش‌شکنی اپتیکی
scope note: بخشی از جنگ اطلاعات شامل اقداماتی برای مقابله با پادکنش اُپتیکی دشمن
related: پادکنش اپتیکی
broader: پادکنش
preferred label: optical counter-countermeasures @en
type: Concept

پادکنش اپتیکی
preferred label: optical countermeasures @en
type: Concept
related: پادکنش‌شکنی اپتیکی

پادکنش
preferred label: countermeasures @en
type: Concept
narrower: پادکنش‌شکنی اپتیکی