پادکنش‌شکنی اپتیکی
preferred label: optical counter-countermeasures @en
type: Concept
related: پادکنش اپتیکی

پادکنش
preferred label: countermeasures @en
type: Concept
narrower: پادکنش اپتیکی

پادکنش اپتیکی
scope note: بخشی از جنگ اطلاعات، شامل به‌کارگیری حسگرهای لیزری و تجهیزات فروسرخ و تجهیزات تلویزیونی و حسگرهای فرابنفش و طیف‌سنج و تجهیزات فراطیفی (hyperspectral) و چندطیفی (multispectral) و فریبگرها
related: پادکنش‌شکنی اپتیکی
broader: پادکنش
preferred label: optical countermeasures @en
type: Concept