فناوری
preferred label: technology @en
type: Concept
related: پایش فناوری

پایش راداری
preferred label: radar monitoring @en
type: Concept
narrower: پایش فناوری

پایش فناوری
scope note: شناسایی و ارزیابی پیشرفت‌های فنّاورانه برای حفظ جایگاه رقابتی
related: فناوری
broader: پایش راداری
preferred label: technology monitoring @en
type: Concept