صنعت
preferred label: industry @en
type: Concept
related: میکرب‌شناسی صنعتی

میکرب‌شناسی
preferred label: microbiology @en
type: Concept
narrower: میکرب‌شناسی صنعتی

میکرب‌شناسی صنعتی
scope note: شاخه‌ای از میکرب‌شناسی که به نحوۀ استفاده از میکرب‌ها یا فراورده‌های میکربی برای تولید مواد غذایی و کالاهای آرایشی و بهداشتی و جز آن در مقیاس صنعتی یا تجاری می‌پردازد.
related: صنعت
broader: میکرب‌شناسی
preferred label: industrial microbiology @en
type: Concept