شیمی
preferred label: chemistry @en
type: Concept
narrower: شیمی‌باستان‌شناسی

شیمی‌باستان‌شناسی
scope note: کاربرد نظریه‌ها و روش‌ها و آزمایش‌های شیمیایی در تاریخ‌گذاری داده‌های باستان‌شناختی و شناخت تنوع مواد مصرفی در جوامع باستانی
broader: شیمی
preferred label: archaeological chemistry @en
type: Concept