شیمی
preferred label: chemistry @en
type: Concept
narrower: شیمی محاسباتی

شیمی محاسباتی
scope note: بخشی از شیمی که در آن با استفاده از رایانه‌ها و قدرت محاسباتی آنها ساختار مولکولی و خواص و واکنش‌ها پیش‌بینی می‌شود.
broader: شیمی
preferred label: computational chemistry @en
type: Concept