شیمی
preferred label: chemistry @en
type: Concept
narrower: شیمی ابرمولکولی

شیمی ابرمولکولی
scope note: حوزه‌ای از علم شیمی که موضوع مطالعۀ آن شکل‌گیری و خواص اَبَرمولکول‌هاست.
broader: شیمی
preferred label: supramolecular chemistry @en
type: Concept