زلزله‌شناسی
preferred label: seismology @en
type: Concept
narrower: زلزله‌شناسی مهندسی

زلزله‌شناسی مهندسی
scope note: علمی کاربردی که مؤلفه‌های مهندسی جنبشی ناشی از زمین‌لرزه را بر پایۀ زلزله‌شناسی و زمین‌شناسی مطالعه و ارزیابی می‌کند.
related: مهندسی زلزله
broader: زلزله‌شناسی
preferred label: engineering seismology @en
type: Concept

مهندسی زلزله
preferred label: earthquake engineering @en
type: Concept
related: زلزله‌شناسی مهندسی