ناوبری ساحلی
scope note: بخشی از ناوبری که در آن ساحل در یک طرف مسیر ناوبری و دریای آزاد در طرف دیگر آن قرار دارد.
broader: ناوبری
preferred label: coastal navigation @en
type: Concept

ناوبری
preferred label: navigation @en
type: Concept
narrower: ناوبری ساحلی