ناوبری
preferred label: navigation @en
type: Concept
narrower: ناوبری الکترونیکی

ناوبری الکترونیکی
scope note: نوعی ناوبری که در آن از انواع ابزارهای الکترونیکی استفاده می‌کنند.
broader: ناوبری
preferred label: electronic navigation @en
type: Concept