ناوبری پیش‌ساحلی
scope note: نوعی ناوبری که در فاصلۀ نسبتاً نزدیک به خط ساحلی انجام ‌می‌شود.
broader: ناوبری
preferred label: inshore navigation @en
type: Concept

ناوبری
preferred label: navigation @en
type: Concept
narrower: ناوبری پیش‌ساحلی