کشتی‌سازی
preferred label: shipbuilding @en
type: Concept
related: فضاهای ناوبری

ناوبری
preferred label: navigation @en
type: Concept
narrower: فضاهای ناوبری

فضاهای ناوبری
scope note: فضاهای بسته‌ای در کشتی، مانند اتاق نقشه و محل سکان‌گیری و اتاق مخابرات که برای ناوبری از آنها استفاده می‌کنند.
related: کشتی‌سازی
broader: ناوبری
preferred label: navigation spaces @en
type: Concept