ناوبری
preferred label: navigation @en
type: Concept
narrower: ناوبری سطحی

ناوبری سطحی
scope note: نوعی ناوبری که در آن از نشانه‌ها و عوارضی که بر سطح زمین قرار دارد برای تعیین موقعیت شناور استفاده می‌کنند.
broader: ناوبری
preferred label: terrestrial navigation @en
type: Concept