بسته‌بندی
preferred label: packaging @en
type: Concept
narrower: بسته‌بندی سخت

بسته‌بندی سخت
scope note: نوعی بسته‌بندی که در آن شکل بسته پس از پر کردن و درزبندی براثر تغییر دما و فشار عوض نمی‌شود.
broader: بسته‌بندی
preferred label: rigid packaging @en
type: Concept