بسته‌بندی خلئی
scope note: نوعی بسته‌بندی‌ که در آن هوای درون بسته کاملاً خارج می‌شود.
broader: بسته‌بندی
preferred label: vacuum packaging @en
type: Concept

بسته‌بندی
preferred label: packaging @en
type: Concept
narrower: بسته‌بندی خلئی