رهبندی آند
scope note: کل رهبندی بین آند و کاتد، جدا از جریان الکترون‌ها
broader: رهبندی الکتریکی
preferred label: anode impedance @en
type: Concept

رهبندی الکتریکی
preferred label: electric impedance @en
type: Concept
narrower: رهبندی آند