رهبندی پویا
scope note: رهبندی مداری با القاوری و ظرفیت موازی در بسامدی که این رهبندی بیشینه باشد.
broader: رهبندی الکتریکی
preferred label: dynamic impedance @en
type: Concept

رهبندی الکتریکی
preferred label: electric impedance @en
type: Concept
narrower: رهبندی پویا