رهبندی متقابل
scope note: نسبت ولتاژ مختلط در یک حلقه (mesh) به جریان مختلط دیگر هنگامی که جریان حلقه‌های دیگر صفر باشد.
broader: رهبندی الکتریکی
preferred label: mutual impedance @en
type: Concept

رهبندی الکتریکی
preferred label: electric impedance @en
type: Concept
narrower: رهبندی متقابل