رهبندی الکتریکی
preferred label: electric impedance @en
type: Concept
narrower: رهبندی توالی‌منفی

رهبندی توالی‌منفی
scope note: رهبندی مدار هنگامی که فقط جریان توالی منفی از آن عبور کند.
broader: رهبندی الکتریکی
preferred label: negative-sequence impedance @en
type: Concept