آلودگی آب
preferred label: water pollution @en
type: Concept
narrower: آلودگی از مواد مغذی

آلودگی از مواد مغذی
scope note: آلودگی منابع آب براثر ورود مقادیر زیاد مواد مغذی
broader: آلودگی آب
preferred label: nutrient pollution @en
type: Concept