جاده و خیابان
preferred label: road and street @en
type: Concept
narrower: معبر عمومی

معبر عمومی
scope note: تمام قسمت‌های خیابان و جاده و بلوار و کوچه و بزرگراه که برای استفادۀ عابران پیاده و دوچرخه و خودرو در نظر گرفته شده است.
broader: جاده و خیابان
preferred label: public way @en
type: Concept