دمش ریزموجی
scope note: ایجاد وارونگی جمعیت در سامانه‌های اتمی و مولکولی یا هسته‌ای با تابش‌دهی
broader: دمش (لیزر)
preferred label: microwave pumping @en
type: Concept

دمش (لیزر)
preferred label: pumping (laser) @en
type: Concept
narrower: دمش ریزموجی