واپاشی بتامنفی
scope note: نوعی واپاشی پرتوزا که در آن از هستۀ مادر الکترون منفی گسیل می‌شود.
broader: واپاشى پرتوزا
preferred label: beta minus decay @en
type: Concept

واپاشى پرتوزا
preferred label: radioactive decay @en
type: Concept
narrower: واپاشی بتامنفی