واپاشى پرتوزا
preferred label: radioactive decay @en
type: Concept
narrower: واپاشی بتامثبت

واپاشی بتامثبت
scope note: نوعی واپایشی پرتوزا که در آن از هستۀ مادر الکترون مثبت گسیل می‌شود.
broader: واپاشى پرتوزا
preferred label: beta plus decay @en
type: Concept