واپاشی دوبتازا
scope note: فروپاشی پرتوزایی که در آن از هستۀ مادر دو الکترون منفی یا مثبت (پوزیترون) گسیل می‌شود.
broader: واپاشى پرتوزا
preferred label: double beta decay @en
type: Concept

واپاشى پرتوزا
preferred label: radioactive decay @en
type: Concept
narrower: واپاشی دوبتازا