نمونه‌برداری پیوسته
scope note: فرایندی که در آن نمونه‌ها به‌طور پیوسته از محیط گرفته می‌شود.
broader: نمونه‌برداری
preferred label: continuous sampling @en
type: Concept

نمونه‌برداری
preferred label: sampling @en
type: Concept
narrower: نمونه‌برداری پیوسته