نمونه مغزه‌ای
preferred label: core sample @en
type: Concept
related: نمونه‌برداری مغزه‌ای

نمونه‌برداری
preferred label: sampling @en
type: Concept
narrower: نمونه‌برداری مغزه‌ای

نمونه‌برداری مغزه‌ای
alternative label: مغزه‌گیری
scope note: روش شناسایی زیرسطحی با استفاده از استوانه‌ای فلزی و توخالی که آن را در خاک فرومی‌کنند تا ستونی از مواد درونی زمین را برای بررسی لایه‌نگاشتی بیرون بکشند.
related: نمونه مغزه‌ای
broader: نمونه‌برداری
preferred label: core sampling @en
type: Concept