نمونه‌برداری
preferred label: sampling @en
type: Concept
narrower: نمونه‌برداری گسسته

نمونه‌برداری گسسته
scope note: فرایندی که در آن تک‌نمونه‌ از محیط گرفته می‌شود.
broader: نمونه‌برداری
preferred label: discrete sampling @en
type: Concept