افشانک
preferred label: nozzle @en
type: Concept
related: نمونه‌برداری هم‌سرعت

نمونه‌برداری
preferred label: sampling @en
type: Concept
narrower: نمونه‌برداری هم‌سرعت

نمونه‌برداری هم‌سرعت
scope note: نوعی نمونه‌برداری که در آن سرعت خطی سیال ورودی به افشانک مساوی با سرعت جریان سیال در نقطۀ نمونه‌برداری باشد بی‌آنکه افشانک اختلالی در سرعت جریان سیال ایجاد کند.
related: افشانک
broader: نمونه‌برداری
preferred label: isokinetic sampling @en
type: Concept