بهداشت محیطی
preferred label: sanitation @en
type: Concept
narrower: پاکداشت غذا

پاکداشت غذا
scope note: مجموعه‌فعالیت‌هایی در بهداشت غذا که در طی فراوری و حمل‌ونقل و عرضه صورت می‌گیرد.
broader: بهداشت محیطی
preferred label: food sanitation @en
type: Concept