آمایش گرمایی
preferred label: thermal conditioning @en
type: Concept
broader: آمایش لجن

لجن فاضلاب
preferred label: sewage sludge @en
type: Concept
related: آمایش لجن

آمایش لجن
scope note: تصفیۀ لجن مایع قبل از آبگیری آن برای تسریع و تسهیل آبگیری که معمولاً با افزودن مواد شیمیایی انجام می‌شود.
narrower: آمایش گرمایی
related: لجن فاضلاب
preferred label: sludge conditioning @en
type: Concept