طیف‌شناسی الکترون
preferred label: electron spectroscopy @en
type: Concept
narrower: طیف‌شناسی فوتوالکترونی

طیف‌شناسی فوتوالکترونی
scope note: شاخه‌ای از طیف‌شناسی الکترون‌ها که در آن انرژی فوتوالکترون‌های گسیل‌شده بررسی می‌شود.
narrower: طیف‌شناسی فوتوالکترونی پرتو ایکس
broader: طیف‌شناسی الکترون
preferred label: photoelectron spectroscopy @en
type: Concept

طیف‌شناسی فوتوالکترونی پرتو ایکس
preferred label: X ray photoelectron spectroscopy @en
type: Concept
broader: طیف‌شناسی فوتوالکترونی