طیف‌شناسی
preferred label: spectroscopy @en
type: Concept
narrower: طیف‌شناسی قطبشی

طیف‌شناسی قطبشی
scope note: نوعی طیف‌شناسی سیرشدگی که در آن یک باریکۀ لیزر سیرکنندۀ دورانی قطبیده، مولکول‌ها را از جهت‌یابی‌های موردنظر تهی می‌کند تا آنها را در جهت‌یابی‌های باقی‌مانده قطبیده کند.
broader: طیف‌شناسی
preferred label: polarization spectroscopy @en
type: Concept