افشانش
preferred label: spraying @en
type: Concept
narrower: افشانش ایستابرقی

اندود ایستابرقی
preferred label: electrostatic coating @en
type: Concept
related: افشانش ایستابرقی

افشانش ایستابرقی
alternative label: افشانش الکترواستاتیکی
scope note: رنگ زدن با استفاده از دستگاهی که در آن قطرات یا ذرات بسیار ریز رنگ به‌صورت باردار بر سطح قطعۀ دارای بار مخالف پاشیده و به‌خوبی جذب می‌شوند.
related: اندود ایستابرقی
broader: افشانش
preferred label: electrostatic spraying @en
type: Concept