استاندارد
preferred label: standard @en
type: Concept
narrower: ریل استاندارد

راه‌آهن
preferred label: railroad @en
type: Concept
related: ریل استاندارد

ریل استاندارد
scope note: ریلی که طول هر شاخۀ آن معادل یکی از معیارهای پذیرفته‌شدۀ جهانی باشد.
related: راه‌آهن
broader: استاندارد
preferred label: standard rail @en
type: Concept