دیوار (بخش سازه‌ای)
preferred label: wall (structural partition) @en
type: Concept
narrower: دیوار غیر باربر

دیوار غیر باربر
scope note: دیواری که هیچ بار قائمی مگر بار خود را تحمل نکند.
broader: دیوار (بخش سازه‌ای)
preferred label: nonbearing wall @en
type: Concept