نقشه‌برداری مهندسی
scope note: شاخه‌ای از نقشه‌برداری که به کار تدارک اجرای بخش‌هایی از طرح‌های مهندسی می‌پردازد.
related: مهندسی
broader: نقشه‌برداری
preferred label: engineering surveying @en
type: Concept

مهندسی
preferred label: engineering @en
type: Concept
related: نقشه‌برداری مهندسی

نقشه‌برداری
preferred label: surveying @en
type: Concept
narrower: نقشه‌برداری مهندسی