سلامت
preferred label: health @en
type: Concept
related: فناوری سلامت

فناوری
preferred label: technology @en
type: Concept
narrower: فناوری سلامت

فناوری سلامت
scope note: تجهیزات ویژه شامل ابزارهای رایانه‌ای و الکترونیکی و مکانیکی که در افزایش توانایی و اثربخشی مداخلات تشخیصی و درمانی به کار می‌آیند.
related: سلامت
broader: فناوری
preferred label: health technology @en
type: Concept