ناو جنگی
preferred label: armed naval ship @en
type: Concept
narrower: ناو مهمات‌بر

ناو مهمات‌بر
alternative label: مهمات‌بر
scope note: ناوی جنگی که ویژۀ حمل مهمات برای ناوها و هواگَردهای نیروی دریایی طراحی شده یا تغییر کاربری داده است.
related: مهمات
broader: ناو جنگی
preferred label: ammunition ship @en
type: Concept

مهمات
preferred label: ammunitions @en
type: Concept
related: ناو مهمات‌بر